Target
Histamine H1 receptor
Ligand
BDBM50001885
Substrate
Meas. Tech.
ChEMBL_1783288 (CHEMBL4254805)
IC50
454±n/a nM
Citation
 Xu, MWang, YYang, FWu, CWang, ZYe, BJiang, XZhao, QLi, JLiu, YZhang, JTian, GHe, YShen, JJiang, H Synthesis and biological evaluation of a series of multi-target N-substituted cyclic imide derivatives with potential antipsychotic effect. Eur J Med Chem 145:74-85 (2018)  
Target
Name:
Histamine H1 receptor
Synonyms:
H1R HISTAMINE H1 HRH1_HUMAN
Type:
G Protein-Coupled Receptor (GPCR)
Mol. Mass.:
55808.72
Organism:
Homo sapiens (Human)
Description:
Cell pellets from SK-N-MC cells transfected with human H1 receptor were used in binding assay.
Residue:
487
  
Inhibitor
Name:
BDBM50001885
Synonyms:
(risperidone)3-{2-[4-(6-Fluoro-benzo[d]isoxazol-3-yl)-piperidin-1-yl]-ethyl}-2-methyl-6,7,8,9-tetrahydro-pyrido[1,2-a]pyrimidin-4-one 2-(2-(4-(benzo[d]isoxazol-3-yl)piperidin-1-yl)ethyl)-7,8,9,9a-tetrahydro-1H-pyrido[1,2-a]pyrimidin-4(6H)-one 3-(2-(4-(6-fluorobenzo[d]isoxazol-3-yl)piperidin-1-yl)ethyl)-2-methyl-6,7,8,9-tetrahydropyrido[1,2-a]pyrimidin-4-one 3-{2-[4-(6-Fluoro-benzo[d]isoxazol-3-yl)-piperidin-1-yl]-ethyl}-2-methyl-6,7,8,9-tetrahydro-pyrido[1,2-a]pyrimidin-4-one (Resperidone) 3-{2-[4-(6-Fluoro-benzo[d]isoxazol-3-yl)-piperidin-1-yl]-ethyl}-2-methyl-6,7,8,9-tetrahydro-pyrido[1,2-a]pyrimidin-4-one(risperidone) CHEMBL85 RISPERDAL US10167256, Risperidone US10259786, Risperidone US8802672, Risperidone | WO2023288027, Cmpd Risperidone
Type:
Small organic molecule
Emp. Form.:
C23H27FN4O2
Mol. Mass.:
410.4845
SMILES:
Cc1nc2CCCCn2c(=O)c1CCN1CCC(CC1)c1noc2cc(F)ccc12
: