Target
Dopamine beta-hydroxylase
Ligand
BDBM50000439
Substrate
Meas. Tech.
ChEBML_59140
pH
4.5±n/a
Ki
149±n/a nM
Comments
extracted
Citation
 Kruse, LIKaiser, CDeWolf, WEFrazee, JSErickson, RWEzekiel, MOhlstein, EHRuffolo, RRBerkowitz, BA Substituted 1-benzylimidazole-2-thiols as potent and orally active inhibitors of dopamine beta-hydroxylase. J Med Chem 29:887-9 (1986)  
Target
Name:
Dopamine beta-hydroxylase
Synonyms:
DBH | DOPO_BOVIN
Type:
PROTEIN
Mol. Mass.:
68136.39
Organism:
Bos taurus
Description:
ChEMBL_50738
Residue:
610
  
Inhibitor
Name:
BDBM50000439
Synonyms:
5-Butyl-pyridine-2-carboxylic acid CHEMBL24510
Type:
Small organic molecule
Emp. Form.:
C10H13NO2
Mol. Mass.:
179.2157
SMILES:
CCCCc1ccc(nc1)C(O)=O
: