Target
Dopamine beta-hydroxylase
Ligand
BDBM50014968
Substrate
Meas. Tech.
ChEBML_59140
pH
4.5±n/a
Ki
55±n/a nM
Comments
extracted
Citation
 Kruse, LIKaiser, CDeWolf, WEFrazee, JSErickson, RWEzekiel, MOhlstein, EHRuffolo, RRBerkowitz, BA Substituted 1-benzylimidazole-2-thiols as potent and orally active inhibitors of dopamine beta-hydroxylase. J Med Chem 29:887-9 (1986)  
Target
Name:
Dopamine beta-hydroxylase
Synonyms:
DBH | DOPO_BOVIN
Type:
PROTEIN
Mol. Mass.:
68136.39
Organism:
Bos taurus
Description:
ChEMBL_50738
Residue:
610
  
Inhibitor
Name:
BDBM50014968
Synonyms:
1-(4-Hydroxy-benzyl)-1,3-dihydro-imidazole-2-thione CHEMBL164747
Type:
Small organic molecule
Emp. Form.:
C10H10N2OS
Mol. Mass.:
206.264
SMILES:
Oc1ccc(Cn2cc[nH]c2=S)cc1
: