Target
Dopamine beta-hydroxylase
Ligand
BDBM50014978
Substrate
Meas. Tech.
ChEBML_59140
pH
4.5±n/a
Ki
5.7±n/a nM
Comments
extracted
Citation
 Kruse, LIKaiser, CDeWolf, WEFrazee, JSErickson, RWEzekiel, MOhlstein, EHRuffolo, RRBerkowitz, BA Substituted 1-benzylimidazole-2-thiols as potent and orally active inhibitors of dopamine beta-hydroxylase. J Med Chem 29:887-9 (1986)  
Target
Name:
Dopamine beta-hydroxylase
Synonyms:
DBH | DOPO_BOVIN
Type:
PROTEIN
Mol. Mass.:
68136.39
Organism:
Bos taurus
Description:
ChEMBL_50738
Residue:
610
  
Inhibitor
Name:
BDBM50014978
Synonyms:
1-(3,5-Difluoro-4-hydroxy-benzyl)-1,3-dihydro-imidazole-2-thione | CHEMBL433493
Type:
Small organic molecule
Emp. Form.:
C10H8F2N2OS
Mol. Mass.:
242.245
SMILES:
Oc1c(F)cc(Cn2cc[nH]c2=S)cc1F
: