Target
Dopamine beta-hydroxylase
Ligand
BDBM50014983
Substrate
Meas. Tech.
ChEBML_59140
pH
4.5±n/a
Ki
41±n/a nM
Comments
extracted
Citation
 Kruse, LIKaiser, CDeWolf, WEFrazee, JSErickson, RWEzekiel, MOhlstein, EHRuffolo, RRBerkowitz, BA Substituted 1-benzylimidazole-2-thiols as potent and orally active inhibitors of dopamine beta-hydroxylase. J Med Chem 29:887-9 (1986)  
Target
Name:
Dopamine beta-hydroxylase
Synonyms:
DBH | DOPO_BOVIN
Type:
PROTEIN
Mol. Mass.:
68136.39
Organism:
Bos taurus
Description:
ChEMBL_50738
Residue:
610
  
Inhibitor
Name:
BDBM50014983
Synonyms:
1-(3,5-Difluoro-benzyl)-1,3-dihydro-imidazole-2-thione | CHEMBL278068
Type:
Small organic molecule
Emp. Form.:
C10H8F2N2S
Mol. Mass.:
226.246
SMILES:
Fc1cc(F)cc(Cn2cc[nH]c2=S)c1
: