Target
Signal transducer and activator of transcription 3
Ligand
BDBM50353441
Substrate
Meas. Tech.
ChEMBL_1784393 (CHEMBL4255910)
IC50
35000±n/a nM
Citation
 Lopez-Tapia, FBrotherton-Pleiss, CYue, PMurakami, HCosta Araujo, ACReis Dos Santos, BIchinotsubo, ERabkin, AShah, RLantz, MChen, STius, MATurkson, J Linker Variation and Structure-Activity Relationship Analyses of Carboxylic Acid-based Small Molecule STAT3 Inhibitors. ACS Med Chem Lett 9:250-255 (2018)  
Target
Name:
Signal transducer and activator of transcription 3
Synonyms:
Acute-phase response factor STAT3 alpha Signal transducer and activator of transcription 3 Transcription Factor STAT3
Type:
Cytosolic Transcription Factor
Mol. Mass.:
88050.28
Organism:
Mus musculus (mouse)
Description:
Bacterially expressed protein was used in the FP assay.
Residue:
770
  
Inhibitor
Name:
BDBM50353441
Synonyms:
CHEMBL1829786
Type:
Small organic molecule
Emp. Form.:
C30H34N2O6S
Mol. Mass.:
550.666
SMILES:
CN(CC(=O)N(Cc1ccc(cc1)C1CCCCC1)c1ccc(C(O)=O)c(O)c1)S(=O)(=O)c1ccc(C)cc1
: