Target
Neuronal acetylcholine receptor subunit alpha-7
Ligand
BDBM50049757
Substrate
Meas. Tech.
ChEMBL_1785005 (CHEMBL4256522)
Ki
2.7±n/a nM
Citation
 Fitch, RWSnider, BBZhou, QFoxman, BMPandya, AAYakel, JLOlson, TTAl-Muhtasib, NXiao, YWelch, KDPanter, KE Absolute Configuration and Pharmacology of the Poison Frog Alkaloid Phantasmidine. J Nat Prod 81:1029-1035 (2018)  
Target
Name:
Neuronal acetylcholine receptor subunit alpha-7
Synonyms:
ACHA7_HUMAN Cholinergic, Nicotinic Alpha7 Neuronal acetylcholine receptor protein alpha-7 subunit Nicotinic acetylcholine receptor alpha-7 (alpha7 nAChR)
Type:
Mol. Mass.:
56448.33
Organism:
Homo sapiens (Human)
Description:
CHRNA7 (NACHRA7)
Residue:
502
  
Inhibitor
Name:
BDBM50049757
Synonyms:
()-2-(6-Chloro-pyridin-3-yl)-7-aza-bicyclo[2.2.1]heptane (+)-epibatidine (1R,2R,4S)-epibatidine (2R,4S)-2-(6-Chloro-pyridin-3-yl)-7-aza-bicyclo[2.2.1]heptane (2R,4S)-2-(6-chloropyridin-3-yl)-7-aza-bicyclo[2.2.1]heptane (R)-2-(6-Chloro-pyridin-3-yl)-7-methyl-7-aza-bicyclo[2.2.1]heptane 2-(6-Chloro-pyridin-3-yl)-7-aza-bicyclo[2.2.1]heptane 2-(6-Chloro-pyridin-3-yl)-7-aza-bicyclo[2.2.1]heptane(+/-) epibatidine 2-(6-Chloro-pyridin-3-yl)-7-azonia-bicyclo[2.2.1]heptane 2-Pyridin-3-yl-7-aza-bicyclo[2.2.1]heptane EPIBATIDINE Epibatidine-(+) exo-2-(6-chloropyridin-3-yl)-7-aza-bicyclo[2.2.1]heptane | rac-(2R)-2-(6-chloropyridin-3-yl)-7-aza-bicyclo[2.2.1]heptane
Type:
Small organic molecule
Emp. Form.:
C11H13ClN2
Mol. Mass.:
208.687
SMILES:
Clc1ccc(cn1)C1CC2CCC1N2
: