Target
Sodium channel protein type 9 subunit alpha
Ligand
BDBM268527
Substrate
Meas. Tech.
ChEMBL_1785063 (CHEMBL4256580)
IC50
20±n/a nM
Citation
 Focken, TChowdhury, SZenova, AGrimwood, MEChabot, CSheng, THemeon, IDecker, SMWilson, MBichler, PJia, QSun, SYoung, CLin, SGoodchild, SJShuart, NGChang, EXie, ZLi, BKhakh, KBankar, GWaldbrook, MKwan, RNelkenbrecher, KKarimi Tari, PChahal, NSojo, LRobinette, CLWhite, ADChen, CAZhang, YPang, JChang, JHHackos, DHJohnson, JPCohen, CJOrtwine, DFSutherlin, DPDehnhardt, CMSafina, BS Design of Conformationally Constrained Acyl Sulfonamide Isosteres: Identification of N-([1,2,4]Triazolo[4,3- a]pyridin-3-yl)methane-sulfonamides as Potent and Selective hNa J Med Chem 61:4810-4831 (2018)  
Target
Name:
Sodium channel protein type 9 subunit alpha
Synonyms:
NENA Peripheral sodium channel 1 SCN9A_HUMAN Voltage-gated sodium channel subunit Nav1.7 hNE-Na
Type:
Protein
Mol. Mass.:
226375.97
Organism:
Homo sapiens (Human)
Description:
Q15858
Residue:
1988
  
Inhibitor
Name:
BDBM268527
Synonyms:
N-(6-cyclopropyl-7-((3,5-dichlorophenoxy)methyl)-[1,2,4]triazolo[4,3-a]pyridin-3-yl)methanesulfonamide US9550775, 51
Type:
Small organic molecule
Emp. Form.:
C17H16Cl2N4O3S
Mol. Mass.:
427.305
SMILES:
CS(=O)(=O)Nc1nnc2cc(COc3cc(Cl)cc(Cl)c3)c(cn12)C1CC1
: