Target
Transient receptor potential cation channel subfamily M member 8
Ligand
BDBM50465610
Substrate
Meas. Tech.
ChEMBL_1785283 (CHEMBL4256800)
IC50
0.200000±n/a nM
Citation
 Bertamino, AIraci, NOstacolo, CAmbrosino, PMusella, SDi Sarno, VCiaglia, TPepe, GSala, MSoldovieri, MVMosca, IGonzalez-Rodriguez, SFernandez-Carvajal, AFerrer-Montiel, ANovellino, ETaglialatela, MCampiglia, PGomez-Monterrey, I Identification of a Potent Tryptophan-Based TRPM8 Antagonist With in Vivo Analgesic Activity. J Med Chem 61:6140-6152 (2018)  
Target
Name:
Transient receptor potential cation channel subfamily M member 8
Synonyms:
Cmr1 Transient receptor potential M8 protein (TRPM8) Trpm8
Type:
Enzyme
Mol. Mass.:
127633.53
Organism:
Rattus norvegicus (Rat)
Description:
Q8R455
Residue:
1104
  
Inhibitor
Name:
BDBM50465610
Synonyms:
CHEMBL4295040
Type:
Small organic molecule
Emp. Form.:
C26H26N2O2
Mol. Mass.:
398.4968
SMILES:
COC(=O)[C@H](Cc1c[nH]c2ccccc12)N(Cc1ccccc1)Cc1ccccc1
: