Target
Mitogen-activated protein kinase kinase kinase 20
Ligand
BDBM50466038
Substrate
Meas. Tech.
ChEMBL_1789702 (CHEMBL4261436)
IC50
457±n/a nM
Citation
 Li, YXiong, YZhang, GZhang, LYang, WYang, JHuang, LQiao, ZMiao, ZLin, GSun, QNiu, TChen, LNiu, DLi, LYang, S Identification of 5-(2,3-Dihydro-1 H-indol-5-yl)-7 H-pyrrolo[2,3- d]pyrimidin-4-amine Derivatives as a New Class of Receptor-Interacting Protein Kinase 1 (RIPK1) Inhibitors, Which Showed Potent Activity in a Tumor Metastasis Model. J Med Chem 61:11398-11414 (2018)  
Target
Name:
Mitogen-activated protein kinase kinase kinase 20
Synonyms:
M3K20_HUMAN MLK7 Mixed lineage kinase 7 | ZAK
Type:
PROTEIN
Mol. Mass.:
91168.58
Organism:
Homo sapiens (Human)
Description:
ChEMBL_1495629
Residue:
800
  
Inhibitor
Name:
BDBM50466038
Synonyms:
CHEMBL4281823
Type:
Small organic molecule
Emp. Form.:
C25H22F3N5O2
Mol. Mass.:
481.4697
SMILES:
CCn1cc(-c2ccc3N(CCc3c2)C(=O)Cc2cccc(OC(F)(F)F)c2)c2c(N)ncnc12
: