Target
Cytidine deaminase
Ligand
BDBM50421666
Substrate
Meas. Tech.
ChEBML_217550
Ki
150±n/a nM
Citation
 Kelley, JADriscoll, JSMcCormack, JJRoth, JSMarquez, VE Furanose-pyranose isomerization of reduced pyrimidine and cyclic urea ribosides. J Med Chem 29:2351-8 (1986)  
Target
Name:
Cytidine deaminase
Synonyms:
CDD_MOUSE Cdd | Cytidine aminohydrolase
Type:
PROTEIN
Mol. Mass.:
16129.75
Organism:
Mus musculus
Description:
ChEMBL_52531
Residue:
146
  
Inhibitor
Name:
BDBM50421666
Synonyms:
CHEMBL2311128 | US9040501, 876404
Type:
Small organic molecule
Emp. Form.:
C9H16N2O6
Mol. Mass.:
248.2331
SMILES:
OC[C@H]1O[C@H]([C@H](O)[C@@H]1O)N1CCC(O)NC1=O
: