Target
Cyclin-K
Ligand
BDBM50466225
Substrate
Meas. Tech.
ChEMBL_1792118 (CHEMBL4264037)
IC50
51±n/a nM
Citation
 Wang, BWu, JWu, YChen, CZou, FWang, AWu, HHu, ZJiang, ZLiu, QWang, WZhang, YLiu, FZhao, MHu, JHuang, TGe, JWang, LRen, TWang, YLiu, JLiu, Q Discovery of 4-(((4-(5-chloro-2-(((1s,4s)-4-((2-methoxyethyl)amino)cyclohexyl)amino)pyridin-4-yl)thiazol-2-yl)amino)methyl)tetrahydro-2H-pyran-4-carbonitrile (JSH-150) as a novel highly selective and potent CDK9 kinase inhibitor. Eur J Med Chem 158:896-916 (2018)  
Target
Name:
Cyclin-K
Synonyms:
CCNK CPR4
Type:
PROTEIN
Mol. Mass.:
64254.10
Organism:
Homo sapiens (Human)
Description:
ChEMBL_107901
Residue:
580
  
Inhibitor
Name:
BDBM50466225
Synonyms:
CHEMBL4278079
Type:
Small organic molecule
Emp. Form.:
C24H36ClN5O2S
Mol. Mass.:
494.093
SMILES:
CCOCCN[C@H]1CC[C@@H](CC1)Nc1cc(-c2csc(NCC3CCOCC3)n2)c(Cl)cn1
: