Target
Dopamine beta-hydroxylase
Ligand
BDBM50000439
Substrate
Meas. Tech.
ChEBML_59102
Ki
149±n/a nM
Citation
 Kruse, LIKaiser, CDeWolf, WEFrazee, JSGarvey, EHilbert, ELFaulkner, WAFlaim, KESawyer, JLBerkowitz, BA Multisubstrate inhibitors of dopamine beta-hydroxylase. 1. Some 1-phenyl and 1-phenyl-bridged derivatives of imidazole-2-thione. J Med Chem 29:2465-72 (1987)  
Target
Name:
Dopamine beta-hydroxylase
Synonyms:
DBH | DOPO_BOVIN
Type:
PROTEIN
Mol. Mass.:
68136.39
Organism:
Bos taurus
Description:
ChEMBL_50738
Residue:
610
  
Inhibitor
Name:
BDBM50000439
Synonyms:
5-Butyl-pyridine-2-carboxylic acid CHEMBL24510
Type:
Small organic molecule
Emp. Form.:
C10H13NO2
Mol. Mass.:
179.2157
SMILES:
CCCCc1ccc(nc1)C(O)=O
: