Target
Neuronal acetylcholine receptor subunit alpha-4/beta-2
Ligand
BDBM50466608
Substrate
Meas. Tech.
ChEMBL_1793435 (CHEMBL4265354)
Ki
>3000±n/a nM
Citation
 Bavo, FPucci, SFasoli, FLammi, CMoretti, MMucchietto, VLattuada, DViani, PDe Palma, CBudriesi, RCorradini, IDowell, CMcIntosh, JMClementi, FBolchi, CGotti, CPallavicini, M Potent Antiglioblastoma Agents by Hybridizing the Onium-Alkyloxy-Stilbene Based Structures of an ?7-nAChR, ?9-nAChR Antagonist and of a Pro-Oxidant Mitocan. J Med Chem 61:10531-10544 (2018)  
Target
Name:
Neuronal acetylcholine receptor subunit alpha-4/beta-2
Synonyms:
Neuronal acetylcholine receptor Alpha-4/Beta-2 Neuronal acetylcholine receptor; alpha4/beta2 | nAChR subtypes alpha4 beta2
Type:
Protein
Mol. Mass.:
Description:
Components:
This complex has 2 components.
Component 1
Name:
Neuronal acetylcholine receptor subunit alpha-4
Synonyms:
ACHA4_HUMAN CHRNA4 protein Neuronal acetylcholine receptor protein alpha-4 subunit Nicotinic acetylcholine receptor alpha4/beta2/alpha5
Type:
Mol. Mass.:
69963.49
Organism:
Homo sapiens (Human)
Description:
NACHRA4
Residue:
627
  
Component 2
Name:
Neuronal acetylcholine receptor subunit beta-2
Synonyms:
ACHB2_HUMAN Neuronal acetylcholine receptor protein beta-2 subunit | Nicotinic acetylcholine receptor alpha3/beta2/alpha5
Type:
Protein
Mol. Mass.:
57020.50
Organism:
Homo sapiens (Human)
Description:
P17787
Residue:
502
  
Inhibitor
Name:
BDBM50466608
Synonyms:
CHEMBL4285772
Type:
Small organic molecule
Emp. Form.:
C28H42INO
Mol. Mass.:
535.5437
SMILES:
[I-].CC[N+](CC)(CC)CCCCCCCCOc1ccc(\C=C\c2ccccc2)cc1
: