Target
Dopamine beta-hydroxylase
Ligand
BDBM50014978
Substrate
Meas. Tech.
ChEMBL_59103 (CHEMBL667896)
IC50
74.0±n/a nM
Citation
 Kruse, LIKaiser, CDeWolf, WEFrazee, JSRoss, STWawro, JWise, MFlaim, KESawyer, JLErickson, RW Multisubstrate inhibitors of dopamine beta-hydroxylase. 2. Structure-activity relationships at the phenethylamine binding site. J Med Chem 30:486-94 (1987)  
Target
Name:
Dopamine beta-hydroxylase
Synonyms:
DBH | DOPO_BOVIN
Type:
PROTEIN
Mol. Mass.:
68136.39
Organism:
Bos taurus
Description:
ChEMBL_50738
Residue:
610
  
Inhibitor
Name:
BDBM50014978
Synonyms:
1-(3,5-Difluoro-4-hydroxy-benzyl)-1,3-dihydro-imidazole-2-thione | CHEMBL433493
Type:
Small organic molecule
Emp. Form.:
C10H8F2N2OS
Mol. Mass.:
242.245
SMILES:
Oc1c(F)cc(Cn2cc[nH]c2=S)cc1F
: