Target
E3 ubiquitin-protein ligase Mdm2
Ligand
BDBM129796
Substrate
Meas. Tech.
ChEMBL_1795643 (CHEMBL4267760)
IC50
0.080000±n/a nM
Citation
 Vaupel, AHolzer, PFerretti, SGuagnano, VKallen, JMah, RMasuya, KRuetz, SRynn, CSchlapbach, AStachyra, TStutz, STodorov, MJeay, SFuret, P In vitro and in vivo characterization of a novel, highly potent p53-MDM2 inhibitor. Bioorg Med Chem Lett 28:3404-3408 (2018)  
Target
Name:
E3 ubiquitin-protein ligase Mdm2
Synonyms:
Double minute 2 protein E3 ubiquitin-protein ligase Mdm2 (p53-binding protein Mdm2) Human Double Minute 2 (HDM2) MDM2-MDMX p53-Binding Protein MDM2 | p53-binding protein
Type:
Oncoprotein
Mol. Mass.:
55196.54
Organism:
Homo sapiens (Human)
Description:
Q00987
Residue:
491
  
Inhibitor
Name:
BDBM129796
Synonyms:
US8815926, 75
Type:
Small organic molecule
Emp. Form.:
C28H27Cl2N5O3
Mol. Mass.:
552.452
SMILES:
COc1ncc(-c2nc3C(=O)N([C@H](c3n2C(C)C)c2ccc(Cl)cc2C)c2cc(Cl)ccc2C)c(OC)n1
: