Target
Phosphatidylinositol 4,5-bisphosphate 3-kinase catalytic subunit beta isoform
Ligand
BDBM50315213
Substrate
Meas. Tech.
ChEMBL_1796235 (CHEMBL4268352)
EC50
44±n/a nM
Citation
 Zhang, NYu, ZYang, XZhou, YWang, JZhang, SLWang, MWHe, Y Synthesis, biological evaluation and structure-activity relationship of a novel class of PI3K? H1047R mutant inhibitors. Eur J Med Chem 158:707-719 (2018)  
Target
Name:
Phosphatidylinositol 4,5-bisphosphate 3-kinase catalytic subunit beta isoform
Synonyms:
PI3-kinase p110 subunit beta PI3Kbeta PIK3CB Phosphatidylinositol 4,5-bisphosphate 3-kinase catalytic subunit beta (PI3Kbeta) Phosphatidylinositol 4,5-bisphosphate 3-kinase catalytic subunit beta isoform (PI3K) Phosphatidylinositol 4,5-bisphosphate 3-kinase catalytic subunit beta isoform (PI3Kbeta) Phosphatidylinositol-4,5-bisphosphate 3-kinase catalytic subunit beta isoform Phosphoinositide 3-Kinase (PI3K), beta Chain A PtdIns-3-kinase p110
Type:
Enzyme Subunit
Mol. Mass.:
122769.00
Organism:
Homo sapiens (Human)
Description:
P42338
Residue:
1070
  
Inhibitor
Name:
BDBM50315213
Synonyms:
2-(difluoromethyl)-1-(4,6-dimorpholin-4-yl-1,3,5-triazin-2-yl)-1H-benzimidazole CHEMBL586702 | TCMDC-137004
Type:
Small organic molecule
Emp. Form.:
C19H21F2N7O2
Mol. Mass.:
417.4125
SMILES:
FC(F)c1nc2ccccc2n1-c1nc(nc(n1)N1CCOCC1)N1CCOCC1
: