Target
Peroxisome proliferator-activated receptor delta
Ligand
BDBM50127222
Substrate
Meas. Tech.
ChEMBL_1797043 (CHEMBL4269160)
EC50
13±n/a nM
Citation
 Li, ZZhou, ZDeng, FLi, YZhang, DZhang, L Design, synthesis, and biological evaluation of novel pan agonists of FFA1, PPAR? and PPAR?. Eur J Med Chem 159:267-276 (2018)  
Target
Name:
Peroxisome proliferator-activated receptor delta
Synonyms:
NR1C2 NUCI Nuclear receptor subfamily 1 group C member 2 PPAR-beta PPARD Peroxisome proliferator-activated receptor Peroxisome proliferator-activated receptor delta
Type:
Enzyme
Mol. Mass.:
49910.45
Organism:
Homo sapiens (Human)
Description:
Q03181
Residue:
441
  
Inhibitor
Name:
BDBM50127222
Synonyms:
CHEMBL38508 {4-[2-(3-Fluoro-4-trifluoromethyl-phenyl)-4-methyl-thiazol-5-ylmethylsulfanyl]-2-methyl-phenoxy}-acetic acid
Type:
Small organic molecule
Emp. Form.:
C21H17F4NO3S2
Mol. Mass.:
471.488
SMILES:
Cc1nc(sc1CSc1ccc(OCC(O)=O)c(C)c1)-c1ccc(c(F)c1)C(F)(F)F
: