Target
Prostacyclin synthase
Ligand
BDBM7962
Substrate
Meas. Tech.
ChEBML_152780
IC50
>100000±n/a nM
Citation
 Cross, PEDickinson, RPParry, MJRandall, MJ Selective thromboxane synthetase inhibitors. 1. 1-[(Aryloxy)alkyl]-1H-imidazoles. J Med Chem 28:1427-32 (1985)  
Target
Name:
Prostacyclin synthase
Synonyms:
CYP8 PTGIS Prostaglandin I2 synthase
Type:
PROTEIN
Mol. Mass.:
57109.87
Organism:
Homo sapiens (Human)
Description:
ChEMBL_157785
Residue:
500
  
Inhibitor
Name:
BDBM7962
Synonyms:
4-(2-Imidazol-1-yl-ethoxy)-benzoic acid; hydrochloride 4-[2-(1H-imidazol-1-yl)ethoxy]benzoic acid CHEMBL537708 dazoxiben
Type:
Small organic molecule
Emp. Form.:
C12H12N2O3
Mol. Mass.:
232.2353
SMILES:
OC(=O)c1ccc(OCCn2ccnc2)cc1
: