Target
Prostaglandin G/H synthase 1/2
Ligand
BDBM7962
Substrate
Meas. Tech.
ChEMBL_158443 (CHEMBL763247)
IC50
>100000±n/a nM
Citation
 Cross, PEDickinson, RPParry, MJRandall, MJ Selective thromboxane synthetase inhibitors. 1. 1-[(Aryloxy)alkyl]-1H-imidazoles. J Med Chem 28:1427-32 (1985)  
Target
Name:
Prostaglandin G/H synthase 1/2
Synonyms:
Prostaglandin G/H synthase (cyclooxygenase)
Type:
Mol. Mass.:
Description:
ASSAY_ID of ChEMBL is 158167
Components:
This complex has 2 components.
Component 1
Name:
Prostaglandin G/H synthase 1
Synonyms:
COX1 Cyclooxygenase-1 (COX-1) PTGS1 | Prostaglandin G/H synthase (cyclooxygenase)
Type:
Protein
Mol. Mass.:
68868.60
Organism:
Ovis aries (Sheep)
Description:
Residue:
600
  
Component 2
Name:
Prostaglandin G/H synthase 2
Synonyms:
COX2 Cyclooxygenase-2 (COX-2) PTGS2 Prostaglandin G/H synthase (cyclooxygenase)
Type:
Protein
Mol. Mass.:
68976.98
Organism:
Ovis aries (Sheep)
Description:
Residue:
603
  
Inhibitor
Name:
BDBM7962
Synonyms:
4-(2-Imidazol-1-yl-ethoxy)-benzoic acid; hydrochloride 4-[2-(1H-imidazol-1-yl)ethoxy]benzoic acid CHEMBL537708 dazoxiben
Type:
Small organic molecule
Emp. Form.:
C12H12N2O3
Mol. Mass.:
232.2353
SMILES:
OC(=O)c1ccc(OCCn2ccnc2)cc1
: