Target
Chymotrypsinogen A
Ligand
BDBM50026011
Substrate
Meas. Tech.
ChEBML_49944
Ki
30800000±n/a nM
Citation
 Thompson, SAAndrews, PRHanzlik, RP Carboxyl-modified amino acids and peptides as protease inhibitors. J Med Chem 29:104-11 (1986)  
Target
Name:
Chymotrypsinogen A
Synonyms:
Alpha-chymotrypsin Chymotrypsin A Chymotrypsin A chain B Chymotrypsinogen A | alpha-Chymotrypsin (α-Chymotrypsin)
Type:
Serine protease
Mol. Mass.:
25670.88
Organism:
Bos taurus (bovine)
Description:
Residue:
245
  
Inhibitor
Name:
BDBM50026011
Synonyms:
(E)-4-Acetylamino-5-phenyl-pent-2-enoic acid methyl ester CHEMBL12829
Type:
Small organic molecule
Emp. Form.:
C14H17NO3
Mol. Mass.:
247.2897
SMILES:
COC(=O)\C=C\C(Cc1ccccc1)NC(C)=O
: