Target
Papain
Ligand
BDBM50026019
Substrate
Meas. Tech.
ChEBML_152507
Ki
26000±n/a nM
Citation
 Thompson, SAAndrews, PRHanzlik, RP Carboxyl-modified amino acids and peptides as protease inhibitors. J Med Chem 29:104-11 (1986)  
Target
Name:
Papain
Synonyms:
Allergen=Car p 1 PPI | Papaya proteinase I
Type:
Enzyme
Mol. Mass.:
38923.01
Organism:
Carica papaya
Description:
Papain was purchased from Sigma, Germany.
Residue:
345
  
Inhibitor
Name:
BDBM50026019
Synonyms:
4-(2-Acetylamino-3-phenyl-propionylamino)-but-2-enoic acid methyl ester | CHEMBL274617
Type:
Small organic molecule
Emp. Form.:
C16H20N2O4
Mol. Mass.:
304.341
SMILES:
COC(=O)\C=C\CNC(=O)C(Cc1ccccc1)NC(C)=O
: