Target
Chymotrypsinogen A
Ligand
BDBM50026021
Substrate
Meas. Tech.
ChEBML_49944
Ki
13900000±n/a nM
Citation
 Thompson, SAAndrews, PRHanzlik, RP Carboxyl-modified amino acids and peptides as protease inhibitors. J Med Chem 29:104-11 (1986)  
Target
Name:
Chymotrypsinogen A
Synonyms:
Alpha-chymotrypsin Chymotrypsin A Chymotrypsin A chain B Chymotrypsinogen A | alpha-Chymotrypsin (α-Chymotrypsin)
Type:
Serine protease
Mol. Mass.:
25670.88
Organism:
Bos taurus (bovine)
Description:
Residue:
245
  
Inhibitor
Name:
BDBM50026021
Synonyms:
2-Acetylamino-3-phenyl-propionamide | CHEMBL274862
Type:
Small organic molecule
Emp. Form.:
C11H14N2O2
Mol. Mass.:
206.2411
SMILES:
CC(=O)NC(Cc1ccccc1)C(N)=O
: