Target
Dopamine beta-hydroxylase
Ligand
BDBM50026185
Substrate
Meas. Tech.
ChEBML_59141
Ki
20000000±n/a nM
Citation
 Bargar, TMBroersma, RJCreemer, LCMcCarthy, JRHornsperger, JMPalfreyman, MGWagner, JJung, MJ Unsaturated heterocyclic amines as potent time-dependent inhibitors of dopamine beta-hydroxylase. J Med Chem 29:315-7 (1986)  
Target
Name:
Dopamine beta-hydroxylase
Synonyms:
DBH | DOPO_BOVIN
Type:
PROTEIN
Mol. Mass.:
68136.39
Organism:
Bos taurus
Description:
ChEMBL_50738
Residue:
610
  
Inhibitor
Name:
BDBM50026185
Synonyms:
CHEMBL105998 | Prop-1-ynyl-benzene
Type:
Small organic molecule
Emp. Form.:
C9H8
Mol. Mass.:
116.1598
SMILES:
CC#Cc1ccccc1
: