Target
Fatty acid-binding protein 5
Ligand
BDBM50468454
Substrate
Meas. Tech.
ChEMBL_1799515 (CHEMBL4271807)
Ki
200±n/a nM
Citation
 Yan, SElmes, MWTong, SHu, KAwwa, MTeng, GYHJing, YFreitag, MGan, QClement, TWei, LSweeney, JMJoseph, OMChe, JCarbonetti, GSWang, LBogdan, DMFalcone, JSmietalo, NZhou, YRalph, BHsu, HCLi, HRizzo, RCDeutsch, DGKaczocha, MOjima, I SAR studies on truxillic acid mono esters as a new class of antinociceptive agents targeting fatty acid binding proteins. Eur J Med Chem 154:233-252 (2018)  
Target
Name:
Fatty acid-binding protein 5
Synonyms:
FABP5 Fatty acid binding protein epidermal | Fatty acid-binding protein 5 (FABP5)
Type:
Enzyme
Mol. Mass.:
15164.79
Organism:
Homo sapiens (Human)
Description:
Q01469
Residue:
135
  
Inhibitor
Name:
BDBM50468454
Synonyms:
CHEMBL4277947
Type:
Small organic molecule
Emp. Form.:
C30H30O4
Mol. Mass.:
454.5568
SMILES:
OC(=O)[C@H]1[C@@H]([C@@H]([C@H]1c1ccccc1)C(=O)O[C@H]1CCCC[C@@H]1c1ccccc1)c1ccccc1
: