Target
Peregrin
Ligand
BDBM50468546
Substrate
Meas. Tech.
ChEMBL_1799793 (CHEMBL4272085)
Kd
16000±n/a nM
Citation
 Zhu, JZhou, CCaflisch, A Structure-based discovery of selective BRPF1 bromodomain inhibitors. Eur J Med Chem 155:337-352 (2018)  
Target
Name:
Peregrin
Synonyms:
BR140 BRPF1_HUMAN Peregrin | Protein Br140
Type:
PROTEIN
Mol. Mass.:
137524.47
Organism:
Homo sapiens (Human)
Description:
ChEMBL_108054
Residue:
1214
  
Inhibitor
Name:
BDBM50468546
Synonyms:
CHEMBL4276793
Type:
Small organic molecule
Emp. Form.:
C25H27N5O2
Mol. Mass.:
429.5142
SMILES:
CCn1c2ccc(cc2nc(C)c1=O)C(=O)NCc1c(C)nn(Cc2ccccc2)c1C
: