Target
Peregrin
Ligand
BDBM50468529
Substrate
Meas. Tech.
ChEMBL_1799793 (CHEMBL4272085)
Kd
>20000±n/a nM
Citation
 Zhu, JZhou, CCaflisch, A Structure-based discovery of selective BRPF1 bromodomain inhibitors. Eur J Med Chem 155:337-352 (2018)  
Target
Name:
Peregrin
Synonyms:
BR140 BRPF1_HUMAN Peregrin | Protein Br140
Type:
PROTEIN
Mol. Mass.:
137524.47
Organism:
Homo sapiens (Human)
Description:
ChEMBL_108054
Residue:
1214
  
Inhibitor
Name:
BDBM50468529
Synonyms:
CHEMBL1394372
Type:
Small organic molecule
Emp. Form.:
C22H24N4O4
Mol. Mass.:
408.4504
SMILES:
COc1ccccc1C(=O)Nc1cc2n(C)c(=O)c(=O)n(C)c2cc1N1CCCC1
: