Target
Peregrin
Ligand
BDBM50468501
Substrate
Meas. Tech.
ChEMBL_1799793 (CHEMBL4272085)
Kd
19000±n/a nM
Citation
 Zhu, JZhou, CCaflisch, A Structure-based discovery of selective BRPF1 bromodomain inhibitors. Eur J Med Chem 155:337-352 (2018)  
Target
Name:
Peregrin
Synonyms:
BR140 BRPF1_HUMAN Peregrin | Protein Br140
Type:
PROTEIN
Mol. Mass.:
137524.47
Organism:
Homo sapiens (Human)
Description:
ChEMBL_108054
Residue:
1214
  
Inhibitor
Name:
BDBM50468501
Synonyms:
CHEMBL4287943
Type:
Small organic molecule
Emp. Form.:
C24H25N5O2
Mol. Mass.:
415.4876
SMILES:
CCn1c2ccc(cc2nc(C)c1=O)C(=O)N(C)Cc1ccn(Cc2ccccc2)n1
: