Target
Dihydrofolate reductase
Ligand
BDBM50026275
Substrate
Meas. Tech.
ChEBML_54965
IC50
3.3±n/a nM
Citation
 Hynes, JBHarmon, SJFloyd, GGFarrington, MHart, LDGale, GRWashtien, WLSusten, SSFreisheim, JH Chemistry and antitumor evaluation of selected classical 2,4-diaminoquinazoline analogues of folic acid. J Med Chem 28:209-15 (1985)  
Target
Name:
Dihydrofolate reductase
Synonyms:
DYR_RAT Dihydrofolate reductase (DHFR) Tetrahydrofolate dehydrogenase
Type:
Enzyme
Mol. Mass.:
21638.84
Organism:
Rattus norvegicus (rat)
Description:
Residue:
187
  
Inhibitor
Name:
BDBM50026275
Synonyms:
2-(4-{[(2,4-Diamino-quinazolin-6-yl)-methyl-amino]-methyl}-benzoylamino)-pentanedioic acid | CHEMBL305253
Type:
Small organic molecule
Emp. Form.:
C22H24N6O5
Mol. Mass.:
452.4632
SMILES:
CN(Cc1ccc(cc1)C(=O)NC(CCC(O)=O)C(O)=O)c1ccc2nc(N)nc(N)c2c1
: