Target
Dihydrofolate reductase
Ligand
BDBM50026272
Substrate
Meas. Tech.
ChEBML_54965
IC50
7.2±n/a nM
Citation
 Hynes, JBHarmon, SJFloyd, GGFarrington, MHart, LDGale, GRWashtien, WLSusten, SSFreisheim, JH Chemistry and antitumor evaluation of selected classical 2,4-diaminoquinazoline analogues of folic acid. J Med Chem 28:209-15 (1985)  
Target
Name:
Dihydrofolate reductase
Synonyms:
DYR_RAT Dihydrofolate reductase (DHFR) Tetrahydrofolate dehydrogenase
Type:
Enzyme
Mol. Mass.:
21638.84
Organism:
Rattus norvegicus (rat)
Description:
Residue:
187
  
Inhibitor
Name:
BDBM50026272
Synonyms:
2-{4-[(2,4-Diamino-quinazolin-6-ylamino)-methyl]-benzoylamino}-pentanedioic acid | CHEMBL423123
Type:
Small organic molecule
Emp. Form.:
C21H22N6O5
Mol. Mass.:
438.4366
SMILES:
Nc1nc(N)c2cc(NCc3ccc(cc3)C(=O)NC(CCC(O)=O)C(O)=O)ccc2n1
: