Target
Transcription activator BRG1
Ligand
BDBM50469323
Substrate
Meas. Tech.
ChEMBL_1803948 (CHEMBL4276240)
Kd
280±n/a nM
Citation
 Papillon, JPNNakajima, KAdair, CDHempel, JJouk, AOKarki, RGMathieu, SMöbitz, HNtaganda, RSmith, TVisser, MHill, SEHurtado, FKChenail, GBhang, HCBric, AXiang, KBushold, GGilbert, TVattay, ADooley, JCosta, EAPark, ILi, AFarley, DLounkine, EYue, QKXie, XZhu, XKulathila, RKing, DHu, TVulic, KCantwell, JLuu, CJagani, Z Discovery of Orally Active Inhibitors of Brahma Homolog (BRM)/SMARCA2 ATPase Activity for the Treatment of Brahma Related Gene 1 (BRG1)/SMARCA4-Mutant Cancers. J Med Chem 61:10155-10172 (2018)  
Target
Name:
Transcription activator BRG1
Synonyms:
ATP-dependent helicase SMARCA4 BRG1 Mitotic growth and transcription activator Protein brahma homolog 1 SMCA4_HUMAN SNF2B SWI/SNF-related matrix-associated actin-dependent regulator of chromatin subfamily A member 4
Type:
PROTEIN
Mol. Mass.:
184666.66
Organism:
Homo sapiens (Human)
Description:
ChEMBL_107968
Residue:
1647
  
Inhibitor
Name:
BDBM50469323
Synonyms:
CHEMBL4290675
Type:
Small organic molecule
Emp. Form.:
C11H9ClN4O
Mol. Mass.:
248.668
SMILES:
Clc1cc(NC(=O)Nc2ccncc2)ccn1
: