Target
Phosphatidylinositol 4-kinase beta
Ligand
BDBM50092783
Substrate
Meas. Tech.
ChEMBL_1804142 (CHEMBL4276434)
Kd
39±n/a nM
Citation
 Rageot, DBohnacker, TMelone, ALanglois, JBBorsari, CHillmann, PSele, AMBeaufils, FZvelebil, MHebeisen, PLöscher, WBurke, JFabbro, DWymann, MP Discovery and Preclinical Characterization of 5-[4,6-Bis({3-oxa-8-azabicyclo[3.2.1]octan-8-yl})-1,3,5-triazin-2-yl]-4-(difluoromethyl)pyridin-2-amine (PQR620), a Highly Potent and Selective mTORC1/2 Inhibitor for Cancer and Neurological Disorders. J Med Chem 61:10084-10105 (2018)  
Target
Name:
Phosphatidylinositol 4-kinase beta
Synonyms:
NPIK PI4K-beta PI4KB PI4Kbeta PIK4CB Phosphatidylinositol 4-kinase, PI4K | PtdIns 4-kinase beta
Type:
Protein
Mol. Mass.:
91373.30
Organism:
Homo sapiens (Human)
Description:
Residue:
816
  
Inhibitor
Name:
BDBM50092783
Synonyms:
CHEMBL3586404
Type:
Small organic molecule
Emp. Form.:
C21H27N5O3
Mol. Mass.:
397.4708
SMILES:
CO[C@H]1CC[C@@H](CC1)N1C(=O)CNc2ncc(nc12)-c1ccc(nc1)C(C)(C)O
: