Target
Serine/threonine-protein kinase mTOR
Ligand
BDBM50429701
Substrate
Meas. Tech.
ChEMBL_1804137 (CHEMBL4276429)
Kd
0.140000±n/a nM
Citation
 Rageot, DBohnacker, TMelone, ALanglois, JBBorsari, CHillmann, PSele, AMBeaufils, FZvelebil, MHebeisen, PLöscher, WBurke, JFabbro, DWymann, MP Discovery and Preclinical Characterization of 5-[4,6-Bis({3-oxa-8-azabicyclo[3.2.1]octan-8-yl})-1,3,5-triazin-2-yl]-4-(difluoromethyl)pyridin-2-amine (PQR620), a Highly Potent and Selective mTORC1/2 Inhibitor for Cancer and Neurological Disorders. J Med Chem 61:10084-10105 (2018)  
Target
Name:
Serine/threonine-protein kinase mTOR
Synonyms:
FK506-binding protein 12-rapamycin complex-associated protein 1 FRAP FRAP1 MTOR Mammalian Target of Rapamycin (mTOR) RAFT1 Rapamycin and FKBP12 target 1 Serine/threonine-protein kinase (mTOR) | mTORC2
Type:
Rapamycin target protein
Mol. Mass.:
288917.12
Organism:
Homo sapiens (Human)
Description:
P42345
Residue:
2549
  
Inhibitor
Name:
BDBM50429701
Synonyms:
AZD-2014 US9102670, 1ap
Type:
Small organic molecule
Emp. Form.:
C25H30N6O3
Mol. Mass.:
462.5441
SMILES:
CNC(=O)c1cccc(c1)-c1ccc2c(nc(nc2n1)N1CCOC[C@@H]1C)N1CCOC[C@@H]1C
: