Target
Cyclin-dependent kinase 6/G1/S-specific cyclin-D3
Ligand
BDBM50470529
Substrate
Meas. Tech.
ChEMBL_1803074 (CHEMBL4275366)
IC50
7760±n/a nM
Citation
 Zhao, HHu, XCao, KZhang, YZhao, KTang, CFeng, B Synthesis and SAR of 4,5-dihydro-1H-pyrazolo[4,3-h]quinazoline derivatives as potent and selective CDK4/6 inhibitors. Eur J Med Chem 157:935-945 (2018)  
Target
Name:
Cyclin-dependent kinase 6/G1/S-specific cyclin-D3
Synonyms:
CDK6/CycD3 CDK6/G1/S-specific cyclin D3 Cyclin-dependent kinase 6 | Cyclin-dependent kinase 6/G1/S-specific cyclin D3
Type:
Protein
Mol. Mass.:
Description:
Components:
This complex has 2 components.
Component 1
Name:
Cyclin-dependent kinase 6
Synonyms:
CDK6 CDKN6 Cyclin-dependent kinase 6 (CDK 6) | Serine/threonine-protein kinase PLSTIRE
Type:
Enzyme Subunit
Mol. Mass.:
36937.42
Organism:
Homo sapiens (Human)
Description:
Q00534
Residue:
326
  
Component 2
Name:
G1/S-specific cyclin-D3
Synonyms:
CCND3 | CCND3_HUMAN
Type:
Enzyme
Mol. Mass.:
32521.90
Organism:
Homo sapiens (Human)
Description:
P30281
Residue:
292
  
Inhibitor
Name:
BDBM50470529
Synonyms:
CHEMBL4279646
Type:
Small organic molecule
Emp. Form.:
C21H24N8O
Mol. Mass.:
404.4683
SMILES:
Cn1nc(C(N)=O)c2CCc3cnc(Nc4cccc(c4)N4CCNCC4)nc3-c12
: