Target
Cyclin-A2/Cyclin-dependent kinase 2
Ligand
BDBM50470532
Substrate
Meas. Tech.
ChEMBL_1803072 (CHEMBL4275364)
IC50
1210±n/a nM
Citation
 Zhao, HHu, XCao, KZhang, YZhao, KTang, CFeng, B Synthesis and SAR of 4,5-dihydro-1H-pyrazolo[4,3-h]quinazoline derivatives as potent and selective CDK4/6 inhibitors. Eur J Med Chem 157:935-945 (2018)  
Target
Name:
Cyclin-A2/Cyclin-dependent kinase 2
Synonyms:
CDK2-CyclinA CDK2/Cyclin A Cyclin A2/dependent kinase 2 Cyclin-Dependent Kinase 2 (CDK2A)
Type:
Protein Complex
Mol. Mass.:
Description:
Cdk2/Cyclin A kinase was purified from insect cells coinfected with Cyclin A/Cdk2 baculovirus.
Components:
This complex has 2 components.
Component 1
Name:
Cyclin-dependent kinase 2
Synonyms:
CDK2 CDK2_HUMAN Cell division protein kinase 2 Protein cereblon/Cyclin-dependent kinase 2 | p33 protein kinase
Type:
Enzyme Subunit
Mol. Mass.:
33938.17
Organism:
Homo sapiens (Human)
Description:
P24941
Residue:
298
  
Component 2
Name:
Cyclin-A2
Synonyms:
CCN1 CCNA1 CCNA2_HUMAN Cyclin-A
Type:
Enzyme Subunit
Mol. Mass.:
48550.19
Organism:
Homo sapiens (Human)
Description:
P20248
Residue:
432
  
Inhibitor
Name:
BDBM50470532
Synonyms:
CHEMBL4287560
Type:
Small organic molecule
Emp. Form.:
C19H21N7O
Mol. Mass.:
363.4163
SMILES:
CN(C)c1cccc(Nc2ncc3CCc4c(nn(C)c4-c3n2)C(N)=O)c1
: