Target
Cyclin-dependent kinase 4/G1/S-specific cyclin-D3
Ligand
BDBM50470534
Substrate
Meas. Tech.
ChEMBL_1803073 (CHEMBL4275365)
IC50
8.0±n/a nM
Citation
 Zhao, HHu, XCao, KZhang, YZhao, KTang, CFeng, B Synthesis and SAR of 4,5-dihydro-1H-pyrazolo[4,3-h]quinazoline derivatives as potent and selective CDK4/6 inhibitors. Eur J Med Chem 157:935-945 (2018)  
Target
Name:
Cyclin-dependent kinase 4/G1/S-specific cyclin-D3
Synonyms:
CDK4/Cyclin D3
Type:
Mol. Mass.:
Description:
ASSAY_ID of ChEMBL is 1806445
Components:
This complex has 2 components.
Component 1
Name:
Cyclin-dependent kinase 4
Synonyms:
CDK4 Cell division protein kinase 4 PSK-J3
Type:
Enzyme Subunit
Mol. Mass.:
33731.96
Organism:
Homo sapiens (Human)
Description:
P11802
Residue:
303
  
Component 2
Name:
G1/S-specific cyclin-D3
Synonyms:
CCND3 | CCND3_HUMAN
Type:
Enzyme
Mol. Mass.:
32521.90
Organism:
Homo sapiens (Human)
Description:
P30281
Residue:
292
  
Inhibitor
Name:
BDBM50470534
Synonyms:
CHEMBL4288758
Type:
Small organic molecule
Emp. Form.:
C21H24N8O
Mol. Mass.:
404.4683
SMILES:
Cn1nc(C(N)=O)c2CCc3cnc(Nc4ccc(cc4)N4CCNCC4)nc3-c12
: