Target
Beta-lactamase TEM
Ligand
BDBM50082305
Substrate
Meas. Tech.
ChEMBL_40568 (CHEMBL856067)
IC50
>108000000±n/a nM
Citation
  TBA Bioorg Med Chem Lett 4:1423-1428 (1994)    Article 
Target
Name:
Beta-lactamase TEM
Synonyms:
BLAT_ECOLX Beta-lactamase (TEM-1) Beta-lactamase TEM-1 Beta-lactamase TEM1D Beta-lactamase TEM1F TEM extended-spectrum beta-lactamase bla
Type:
Enzyme
Mol. Mass.:
31512.33
Organism:
Escherichia coli
Description:
P62593
Residue:
286
  
Inhibitor
Name:
BDBM50082305
Synonyms:
3-Pentadecyl-phenol 3-pentadecylphenol CHEMBL34689
Type:
Small organic molecule
Emp. Form.:
C21H36O
Mol. Mass.:
304.5099
SMILES:
CCCCCCCCCCCCCCCc1cccc(O)c1
: