Target
Beta-lactamase
Ligand
BDBM50082305
Substrate
Meas. Tech.
ChEMBL_41045 (CHEMBL650467)
IC50
108000000±n/a nM
Citation
  TBA Bioorg Med Chem Lett 4:1423-1428 (1994)    Article 
Target
Name:
Beta-lactamase
Synonyms:
BLAC_STAAU Penicillinase | blaZ
Type:
PROTEIN
Mol. Mass.:
31367.53
Organism:
Staphylococcus aureus
Description:
ChEMBL_41052
Residue:
281
  
Inhibitor
Name:
BDBM50082305
Synonyms:
3-Pentadecyl-phenol 3-pentadecylphenol CHEMBL34689
Type:
Small organic molecule
Emp. Form.:
C21H36O
Mol. Mass.:
304.5099
SMILES:
CCCCCCCCCCCCCCCc1cccc(O)c1
: