Target
Substance-K receptor
Ligand
BDBM50469874
Substrate
Meas. Tech.
ChEMBL_143062 (CHEMBL858020)
Ki
0.154882±n/a nM
Citation
 Bradshaw, CGCeszkowski, KTurcatti, GBeresford, IJChollet, A Synthesis and characterization of selective fluorescent ligands for the neurokinin NK2 receptor. J Med Chem 37:1991-5 (1994)  
Target
Name:
Substance-K receptor
Synonyms:
NK-2 receptor NK2R NKNAR Neurokinin A receptor Neurokinin-2 (NK-2) SKR TACR2 Tachykinin receptor 2 (NK2) | hnk-3
Type:
Protein
Mol. Mass.:
44455.78
Organism:
Homo sapiens (Human)
Description:
P21452
Residue:
398
  
Inhibitor
Name:
BDBM50469874
Synonyms:
CHEMBL59780
Type:
Small organic molecule
Emp. Form.:
C49H61N9O8
Mol. Mass.:
904.0641
SMILES:
CCCC[C@H](NC(=O)[C@@H]1CCCN1C(=O)[C@@H]1CCCN1C(=O)[C@H](Cc1ccccc1)NC(=O)[C@H](Cc1c[nH]c2ccccc12)NC(=O)[C@H](C)NC(=O)[C@H](C)NC(=O)c1ccccc1)C(N)=O
: