Target
Similar to alpha-tubulin isoform 1
Ligand
BDBM50037448
Substrate
Meas. Tech.
ChEMBL_211352 (CHEMBL873906)
IC50
380±n/a nM
Citation
 Li, LWang, HKKuo, SCWu, TSMauger, ALin, CMHamel, ELee, KH Antitumor agents. 155. Synthesis and biological evaluation of 3',6,7-substituted 2-phenyl-4-quinolones as antimicrotubule agents. J Med Chem 37:3400-7 (1994)  
Target
Name:
Similar to alpha-tubulin isoform 1
Synonyms:
Similar to alpha-tubulin isoform 1
Type:
PROTEIN
Mol. Mass.:
10383.05
Organism:
Bos taurus
Description:
ChEMBL_104716
Residue:
99
  
Inhibitor
Name:
BDBM50037448
Synonyms:
6-Dimethylamino-2-(3-methoxy-phenyl)-1H-quinolin-4-one | CHEMBL301589
Type:
Small organic molecule
Emp. Form.:
C18H18N2O2
Mol. Mass.:
294.3477
SMILES:
COc1cccc(c1)-c1cc(O)c2cc(ccc2n1)N(C)C
: