Target
Melatonin receptor type 1C
Ligand
BDBM50470187
Substrate
Meas. Tech.
ChEMBL_104757 (CHEMBL712440)
Ki
0.100000±n/a nM
Citation
 Langlois, MBrémont, BShen, SPoncet, AAndrieux, JSicsic, SSerraz, IMathé-Allainmat, MRenard, PDelagrange, P Design and synthesis of new naphthalenic derivatives as ligands for 2-[125I]iodomelatonin binding sites. J Med Chem 38:2050-60 (1995)  
Target
Name:
Melatonin receptor type 1C
Synonyms:
CKB Mel-1C-R Melatonin receptor type 1C
Type:
PROTEIN
Mol. Mass.:
38595.98
Organism:
Gallus gallus
Description:
ChEMBL_104739
Residue:
346
  
Inhibitor
Name:
BDBM50470187
Synonyms:
CHEMBL428882
Type:
Small organic molecule
Emp. Form.:
C16H19NO3
Mol. Mass.:
273.327
SMILES:
COc1ccc2ccc(OC)c(CCNC(C)=O)c2c1
: