Target
Melatonin receptor type 1C
Ligand
BDBM50035179
Substrate
Meas. Tech.
ChEMBL_104757 (CHEMBL712440)
Ki
0.540000±n/a nM
Citation
 Langlois, MBrémont, BShen, SPoncet, AAndrieux, JSicsic, SSerraz, IMathé-Allainmat, MRenard, PDelagrange, P Design and synthesis of new naphthalenic derivatives as ligands for 2-[125I]iodomelatonin binding sites. J Med Chem 38:2050-60 (1995)  
Target
Name:
Melatonin receptor type 1C
Synonyms:
CKB Mel-1C-R Melatonin receptor type 1C
Type:
PROTEIN
Mol. Mass.:
38595.98
Organism:
Gallus gallus
Description:
ChEMBL_104739
Residue:
346
  
Inhibitor
Name:
BDBM50035179
Synonyms:
Agomelatine N-[2-(7-Methoxy-naphthalen-1-yl)-ethyl]-acetamide S 20098 US11091445, Compound code IA2-76
Type:
Small organic molecule
Emp. Form.:
C15H17NO2
Mol. Mass.:
243.301
SMILES:
COc1ccc2cccc(CCNC(C)=O)c2c1
: