Target
Cholecystokinin receptor type A
Ligand
BDBM50470630
Substrate
Meas. Tech.
ChEMBL_49874 (CHEMBL857786)
Ki
302±n/a nM
Citation
 Kalindjian, SBBuck, IMCushnir, JRDunstone, DJHudson, MLLow, CMMcDonald, IMPether, MJSteel, KITozer, MJ Improving the affinity and selectivity of a nonpeptide series of cholecystokinin-B/gastrin receptor antagonists based on the dibenzobicyclo[2.2.2]octane skeleton. J Med Chem 38:4294-302 (1995)  
Target
Name:
Cholecystokinin receptor type A
Synonyms:
CCK-A receptor CCK1-R CCKAR_CAVPO Cholecystokinin receptor type A | Cholecystokinin-1 receptor
Type:
Mol. Mass.:
48229.77
Organism:
Cavia porcellus
Description:
Residue:
430
  
Inhibitor
Name:
BDBM50470630
Synonyms:
CHEMBL436187
Type:
Small organic molecule
Emp. Form.:
C46H45N11O3
Mol. Mass.:
799.9214
SMILES:
O=C(Nc1cc(cc(c1)-n1cnnn1)-n1cnnn1)[C@H](Cc1ccccc1)NC(=O)C1C(C2c3ccccc3C1c1ccccc21)C(=O)NCC12CC3CC(CC(C3)C1)C2
: