Target
Cholecystokinin receptor type A
Ligand
BDBM50470640
Substrate
Meas. Tech.
ChEMBL_49874 (CHEMBL857786)
Ki
447±n/a nM
Citation
 Kalindjian, SBBuck, IMCushnir, JRDunstone, DJHudson, MLLow, CMMcDonald, IMPether, MJSteel, KITozer, MJ Improving the affinity and selectivity of a nonpeptide series of cholecystokinin-B/gastrin receptor antagonists based on the dibenzobicyclo[2.2.2]octane skeleton. J Med Chem 38:4294-302 (1995)  
Target
Name:
Cholecystokinin receptor type A
Synonyms:
CCK-A receptor CCK1-R CCKAR_CAVPO Cholecystokinin receptor type A | Cholecystokinin-1 receptor
Type:
Mol. Mass.:
48229.77
Organism:
Cavia porcellus
Description:
Residue:
430
  
Inhibitor
Name:
BDBM50470640
Synonyms:
CHEMBL443028
Type:
Small organic molecule
Emp. Form.:
C45H38N4O7
Mol. Mass.:
746.8058
SMILES:
OC(=O)c1cc(NC(=O)[C@H](Cc2ccccc2)NC(=O)C2C(C3c4ccccc4C2c2ccccc32)C(=O)NCCc2c[nH]c3ccccc23)cc(c1)C(O)=O
: