Target
Alpha-1A adrenergic receptor
Ligand
BDBM50067212
Substrate
Meas. Tech.
ChEMBL_33592 (CHEMBL647141)
Ki
933±n/a nM
Citation
 Meyer, MDAltenbach, RJHancock, AABuckner, SAKnepper, SMKerwin, JF Synthesis and in vitro characterization of N-[5-(4,5-dihydro-1H-imidazol-2-yl)-2-hydroxy-5,6,7,8- tetrahydronaphthalen-1-yl]methanesulfonamide and its enantiomers: a novel selective alpha 1A receptor agonist. J Med Chem 39:4116-9 (1996)  
Target
Name:
Alpha-1A adrenergic receptor
Synonyms:
ADA1A_BOVIN ADRA1C Alpha 1A-adrenoreceptor Cerebral cortex alpha adrenergic receptor | adrenergic Alpha1
Type:
Enzyme Catalytic Domain
Mol. Mass.:
51492.08
Organism:
CALF
Description:
adrenergic Alpha1 0 CALF
Residue:
466
  
Inhibitor
Name:
BDBM50067212
Synonyms:
CHEBI:8093 Duo-Medihaler | Phenylephrine
Type:
Small organic molecule
Emp. Form.:
C9H13NO2
Mol. Mass.:
167.205
SMILES:
CNC[C@H](O)c1cccc(O)c1
: