Target
Melatonin receptor type 1C
Ligand
BDBM50470187
Substrate
Meas. Tech.
ChEMBL_104764 (CHEMBL714909)
Ki
0.239883±n/a nM
Citation
 Sicsic, SSerraz, IAndrieux, JBrémont, BMathé-Allainmat, MPoncet, AShen, SLanglois, M Three-dimensional quantitative structure-activity relationship of melatonin receptor ligands: a comparative molecular field analysis study. J Med Chem 40:739-48 (1997)  
Target
Name:
Melatonin receptor type 1C
Synonyms:
CKB Mel-1C-R Melatonin receptor type 1C
Type:
PROTEIN
Mol. Mass.:
38595.98
Organism:
Gallus gallus
Description:
ChEMBL_104739
Residue:
346
  
Inhibitor
Name:
BDBM50470187
Synonyms:
CHEMBL428882
Type:
Small organic molecule
Emp. Form.:
C16H19NO3
Mol. Mass.:
273.327
SMILES:
COc1ccc2ccc(OC)c(CCNC(C)=O)c2c1
: