Target
Melatonin receptor type 1A/1B
Ligand
BDBM50471119
Substrate
Meas. Tech.
ChEMBL_104783 (CHEMBL714926)
Ki
0.480000±n/a nM
Citation
 Spadoni, GBalsamini, CDiamantini, GDi Giacomo, BTarzia, GMor, MPlazzi, PVRivara, SLucini, VNonno, RPannacci, MFraschini, FStankov, BM Conformationally restrained melatonin analogues: synthesis, binding affinity for the melatonin receptor, evaluation of the biological activity, and molecular modeling study. J Med Chem 40:1990-2002 (1997)  
Target
Name:
Melatonin receptor type 1A/1B
Synonyms:
Melatonin receptor
Type:
Mol. Mass.:
Description:
ASSAY_ID of ChEMBL is 104946
Components:
This complex has 2 components.
Component 1
Name:
Melatonin receptor type 1A
Synonyms:
MTNR1A MTR1A_HUMAN Mel1a melatonin receptor Melatonin receptor Melatonin receptor type 1 (MT1) | Melatonin receptor type 1A
Type:
Enzyme
Mol. Mass.:
39392.94
Organism:
Homo sapiens (Human)
Description:
P48039
Residue:
350
  
Component 2
Name:
Melatonin receptor type 1B
Synonyms:
MTNR1B Mel-1B-R Melatonin 1B Melatonin receptor type 1B | Melatonin receptor type 2 (MT2)
Type:
Enzyme
Mol. Mass.:
40203.54
Organism:
Homo sapiens (Human)
Description:
P49286
Residue:
362
  
Inhibitor
Name:
BDBM50471119
Synonyms:
CHEMBL61380
Type:
Small organic molecule
Emp. Form.:
C18H22N2O4
Mol. Mass.:
330.3783
SMILES:
CCOC(=O)c1[nH]c2ccc(OC)c3CCC(CNC(C)=O)c1c23
: