Target
Melatonin receptor type 1A/1B
Ligand
BDBM50471127
Substrate
Meas. Tech.
ChEMBL_104782 (CHEMBL714925)
Ki
0.230000±n/a nM
Citation
 Tarzia, GDiamantini, GDi Giacomo, BSpadoni, GEsposti, DNonno, RLucini, VPannacci, MFraschini, FStankov, BM 1-(2-Alkanamidoethyl)-6-methoxyindole derivatives: a new class of potent indole melatonin analogues. J Med Chem 40:2003-10 (1997)  
Target
Name:
Melatonin receptor type 1A/1B
Synonyms:
Melatonin receptor
Type:
Mol. Mass.:
Description:
ASSAY_ID of ChEMBL is 104946
Components:
This complex has 2 components.
Component 1
Name:
Melatonin receptor type 1A
Synonyms:
MTNR1A MTR1A_HUMAN Mel1a melatonin receptor Melatonin receptor Melatonin receptor type 1 (MT1) | Melatonin receptor type 1A
Type:
Enzyme
Mol. Mass.:
39392.94
Organism:
Homo sapiens (Human)
Description:
P48039
Residue:
350
  
Component 2
Name:
Melatonin receptor type 1B
Synonyms:
MTNR1B Mel-1B-R Melatonin 1B Melatonin receptor type 1B | Melatonin receptor type 2 (MT2)
Type:
Enzyme
Mol. Mass.:
40203.54
Organism:
Homo sapiens (Human)
Description:
P49286
Residue:
362
  
Inhibitor
Name:
BDBM50471127
Synonyms:
CHEMBL62088
Type:
Small organic molecule
Emp. Form.:
C16H20N2O4
Mol. Mass.:
304.341
SMILES:
CCC(=O)NCCn1c(cc2ccc(OC)cc12)C(=O)OC
: