Target
Estrogen receptor beta
Ligand
BDBM50471380
Substrate
Meas. Tech.
ChEMBL_101082 (CHEMBL708494)
IC50
0.700000±n/a nM
Citation
 Grese, TACho, SFinley, DRGodfrey, AGJones, CDLugar, CWMartin, MJMatsumoto, KPennington, LDWinter, MAAdrian, MDCole, HWMagee, DEPhillips, DLRowley, ERShort, LLGlasebrook, ALBryant, HU Structure-activity relationships of selective estrogen receptor modulators: modifications to the 2-arylbenzothiophene core of raloxifene. J Med Chem 40:146-67 (1997)  
Target
Name:
Estrogen receptor beta
Synonyms:
Estrogen receptor
Type:
Mol. Mass.:
Description:
ASSAY_ID of ChEMBL is 99778
Components:
This complex has 2 components.
Component 1
Name:
Estrogen receptor beta
Synonyms:
ER-beta ESR2_HUMAN Estradiol receptor beta (ERβ) Estrogen receptor (ER beta) Estrogen receptor beta (ER beta) NR3A2 estrogen beta
Type:
Protein
Mol. Mass.:
59238.43
Organism:
Homo sapiens (Human)
Description:
Q92731
Residue:
530
  
Component 2
Name:
Estrogen receptor
Synonyms:
ER ESR ESR1_HUMAN Estrogen receptor Estrogen receptor (ER-alpha) Estrogen receptor alpha (ER) Nuclear receptor subfamily 3 group A member 1
Type:
Protein
Mol. Mass.:
66230.44
Organism:
Homo sapiens (Human)
Description:
P03372
Residue:
595
  
Inhibitor
Name:
BDBM50471380
Synonyms:
CHEMBL44492
Type:
Small organic molecule
Emp. Form.:
C29H29NO3S
Mol. Mass.:
471.61
SMILES:
Cc1ccccc1-c1sc2cc(O)ccc2c1C(=O)c1ccc(OCCN2CCCCC2)cc1
: