Target
Melatonin receptor type 1A/1B
Ligand
BDBM50471833
Substrate
Meas. Tech.
ChEMBL_104784 (CHEMBL714927)
Ki
0.176000±n/a nM
Citation
 Mor, MRivara, SSilva, CBordi, FPlazzi, PVSpadoni, GDiamantini, GBalsamini, CTarzia, GFraschini, FLucini, VNonno, RStankov, BM Melatonin receptor ligands: synthesis of new melatonin derivatives and comprehensive comparative molecular field analysis (CoMFA) study. J Med Chem 41:3831-44 (1998)  
Target
Name:
Melatonin receptor type 1A/1B
Synonyms:
Melatonin receptor
Type:
Mol. Mass.:
Description:
ASSAY_ID of ChEMBL is 104946
Components:
This complex has 2 components.
Component 1
Name:
Melatonin receptor type 1A
Synonyms:
MTNR1A MTR1A_HUMAN Mel1a melatonin receptor Melatonin receptor Melatonin receptor type 1 (MT1) | Melatonin receptor type 1A
Type:
Enzyme
Mol. Mass.:
39392.94
Organism:
Homo sapiens (Human)
Description:
P48039
Residue:
350
  
Component 2
Name:
Melatonin receptor type 1B
Synonyms:
MTNR1B Mel-1B-R Melatonin 1B Melatonin receptor type 1B | Melatonin receptor type 2 (MT2)
Type:
Enzyme
Mol. Mass.:
40203.54
Organism:
Homo sapiens (Human)
Description:
P49286
Residue:
362
  
Inhibitor
Name:
BDBM50471833
Synonyms:
CHEMBL127337
Type:
Small organic molecule
Emp. Form.:
C13H14Br2N2O2
Mol. Mass.:
390.07
SMILES:
COc1cc2c(CCNC(C)=O)c(Br)[nH]c2cc1Br
: